{"text_format":"1","workbook":"xlsx","n_sheets":7,"sheets":["Historical Max","1990","1998","1999","2000","2002","M8260"],"not_rendered":{"charts":1,"images":0,"macros":0,"external_links":0,"defined_names":20,"comments":1,"pivot_tables":2},"unopened":[],"bounds":{"document_bytes":16777216,"sheet_cells":100000,"rows_first":2000,"rows_last":500,"rows_between":2000,"halvings":0,"cell_chars":16384,"cell_head_chars":4096},"cells_cut":0,"cells_raw":0,"read":"whole","date_system":"1900"}

{"sheet":"Historical Max","index":0,"n_rows":21,"n_cols":13,"rows_kept":21,"cut":false,"hidden":false,"merged":[]}
[]
[null,"Max Conc.","Sample","Depth","Date",null,"PivotTable2",null,null,null,null,null,"PivotTable1"]
["Method 8260",null,null,null,null,null,"Method 8260","Sample","Depth","DDate","Max of Value",null,"Count of Value"]
["Benzene",{"$f":"MAX('1990'!$B$6:$H$6,'1998'!$B$6:$F$6,'1999'!$B$6:$M$6,'2000'!$B$6:$H$6,'2002'!$B$6:$U$6)","v":7},{"$f":"IF(ISERROR(LOOKUP($B$4,'2000'!$B$6:$H$6,'2000'!$B$1:$H$1)),\"NA\",(LOOKUP($B$4,'2000'!$B$6:$H$6,'2000'!$B$1:$H$1)))","v":"SB-23"},{"$f":"IF(ISERROR(LOOKUP(B4,'2000'!$B6:$H6,'2000'!B$2:H$2)),\"NA\",(LOOKUP(B4,'2000'!$B6:$H6,'2000'!B$2:H$2)))","v":"(14-16)"},{"$f":"IF(ISERROR(LOOKUP(B4,'2000'!$B6:$H6,'2000'!B$3:H$3)),\"NA\",(LOOKUP(B4,'2000'!$B6:$H6,'2000'!B$3:H$3)))","v":"2000-10-04"},null,"Benzene","SB-23","(14-16)","2000-10-04",7,null,255]
["Toluene",{"$f":"MAX('1990'!$B$7:$H$7,'1998'!$B$7:$F$7,'1999'!$B$7:$M$7,'2000'!$B$7:$H$7,'2002'!$G$7:$U$7)","v":16},{"$f":"IF(ISERROR(LOOKUP($B$5,'2000'!$B$7:$H$7,'2000'!$B$1:$H$1)),\"NA\",(LOOKUP($B$5,'2000'!$B$7:$H$7,'2000'!$B$1:$H$1)))","v":"SB-23"},{"$f":"IF(ISERROR(LOOKUP(B5,'2000'!$B7:$H7,'2000'!B$2:H$2)),\"NA\",(LOOKUP(B5,'2000'!$B7:$H7,'2000'!B$2:H$2)))","v":"(10-12)"},{"$f":"IF(ISERROR(LOOKUP(B5,'2000'!$B7:$H7,'2000'!B$3:H$3)),\"NA\",(LOOKUP(B5,'2000'!$B7:$H7,'2000'!B$3:H$3)))","v":"2000-10-04"},null,"Toluene","SB-23","(10-12)","2000-10-04",16]
["Ethylbenzene",{"$f":"MAX('1990'!B8:H8,'1998'!B8:F8,'1999'!B8:M8,'2000'!B8:H8,'2002'!G8:U8)","v":12.8},{"$f":"IF(ISERROR(LOOKUP(B6,'2000'!$B8:$H8,'2000'!$B$1:H$1)),\"NA\",(LOOKUP(B6,'2000'!$B8:$H8,'2000'!B$1:H$1)))","v":"SB-23"},{"$f":"IF(ISERROR(LOOKUP(B6,'2000'!$B8:$H8,'2000'!B$2:H$2)),\"NA\",(LOOKUP(B6,'2000'!$B8:$H8,'2000'!B$2:H$2)))","v":"(14-16)"},{"$f":"IF(ISERROR(LOOKUP(B6,'2000'!$B8:$H8,'2000'!B$3:H$3)),\"NA\",(LOOKUP(B6,'2000'!$B8:$H8,'2000'!B$3:H$3)))","v":"2000-10-04"},null,"Ethylbenzene","SB-4","5 Feet","1990-01-12",12.8]
["Total Xylenes",{"$f":"MAX('1990'!B9:H9,'1998'!B9:F9,'1999'!B9:M9,'2000'!B9:H9,'2002'!G9:U9)","v":116},{"$f":"IF(ISERROR(LOOKUP(B7,'2000'!$B9:$H9,'2000'!$B$1:H$1)),\"NA\",(LOOKUP(B7,'2000'!$B9:$H9,'2000'!B$1:H$1)))","v":"SB-23"},{"$f":"IF(ISERROR(LOOKUP(B7,'2000'!$B9:$H9,'2000'!B$2:H$2)),\"NA\",(LOOKUP(B7,'2000'!$B9:$H9,'2000'!B$2:H$2)))","v":"(14-16)"},{"$f":"IF(ISERROR(LOOKUP(B7,'2000'!$B9:$H9,'2000'!B$3:H$3)),\"NA\",(LOOKUP(B7,'2000'!$B9:$H9,'2000'!B$3:H$3)))","v":"2000-10-04"},null,"Total Xylenes","SB-7","5 Feet","1990-01-12",116]
["MTBE",{"$f":"MAX('1990'!B10:H10,'1998'!B10:F10,'1999'!B10:M10,'2000'!B10:H10,'2002'!G10:U10)","v":0.5},{"$f":"IF(ISERROR(LOOKUP(B8,'2000'!$B10:$H10,'2000'!$B$1:H$1)),\"NA\",(LOOKUP(B8,'2000'!$B10:$H10,'2000'!B$1:H$1)))","v":"SB-23"},{"$f":"IF(ISERROR(LOOKUP(B8,'2000'!$B10:$H10,'2000'!B$2:H$2)),\"NA\",(LOOKUP(B8,'2000'!$B10:$H10,'2000'!B$2:H$2)))","v":"(14-16)"},{"$f":"IF(ISERROR(LOOKUP(B8,'2000'!$B10:$H10,'2000'!B$3:H$3)),\"NA\",(LOOKUP(B8,'2000'!$B10:$H10,'2000'!B$3:H$3)))","v":"2000-10-04"},null,"MTBE","SB-23","(14-16)","2000-10-04",0.5]
["Method 8270"]
["Benzo(a)anthracene",{"$f":"MAX('1990'!B13:H13,'1998'!B12:F12,'1999'!B12:M12,'2000'!B12:H12,'2002'!G12:U12)","v":1.23},{"$f":"IF(ISERROR(LOOKUP(B10,'2000'!$B12:$H12,'2000'!$B$1:H$1)),\"NA\",(LOOKUP(B10,'2000'!$B12:$H12,'2000'!B$1:H$1)))","v":"NA"},{"$f":"IF(ISERROR(LOOKUP(B10,'2000'!$B12:$H12,'2000'!B$2:H$2)),\"NA\",(LOOKUP(B10,'2000'!$B12:$H12,'2000'!B$2:H$2)))","v":"NA"},{"$f":"IF(ISERROR(LOOKUP(B10,'2000'!$B12:$H12,'2000'!B$3:H$3)),\"NA\",(LOOKUP(B10,'2000'!$B12:$H12,'2000'!B$3:H$3)))","v":"NA"}]
["Benzo(a)pyrene",{"$f":"MAX('1990'!B14:H14,'1998'!B13:F13,'1999'!B13:M13,'2000'!B13:H13,'2002'!G13:U13)","v":1.56},{"$f":"IF(ISERROR(LOOKUP(B11,'2000'!$B13:$H13,'2000'!$B$1:H$1)),\"NA\",(LOOKUP(B11,'2000'!$B13:$H13,'2000'!B$1:H$1)))","v":"NA"},{"$f":"IF(ISERROR(LOOKUP(B11,'2000'!$B13:$H13,'2000'!B$2:H$2)),\"NA\",(LOOKUP(B11,'2000'!$B13:$H13,'2000'!B$2:H$2)))","v":"NA"},{"$f":"IF(ISERROR(LOOKUP(B11,'2000'!$B13:$H13,'2000'!B$3:H$3)),\"NA\",(LOOKUP(B11,'2000'!$B13:$H13,'2000'!B$3:H$3)))","v":"NA"}]
["Benzo(b)fluoranthene",{"$f":"MAX('1990'!B15:H15,'1998'!B14:F14,'1999'!B14:M14,'2000'!B14:H14,'2002'!G14:U14)","v":2.27},{"$f":"IF(ISERROR(LOOKUP(B12,'2000'!$B14:$H14,'2000'!$B$1:H$1)),\"NA\",(LOOKUP(B12,'2000'!$B14:$H14,'2000'!B$1:H$1)))","v":"NA"},{"$f":"IF(ISERROR(LOOKUP(B12,'2000'!$B14:$H14,'2000'!B$2:H$2)),\"NA\",(LOOKUP(B12,'2000'!$B14:$H14,'2000'!B$2:H$2)))","v":"NA"},{"$f":"IF(ISERROR(LOOKUP(B12,'2000'!$B14:$H14,'2000'!B$3:H$3)),\"NA\",(LOOKUP(B12,'2000'!$B14:$H14,'2000'!B$3:H$3)))","v":"NA"}]
["Benzo(k)fluoranthene",{"$f":"MAX('1990'!B16:H16,'1998'!B15:F15,'1999'!B15:M15,'2000'!B15:H15,'2002'!G15:U15)","v":1.31},{"$f":"IF(ISERROR(LOOKUP(B13,'2000'!$B15:$H15,'2000'!$B$1:H$1)),\"NA\",(LOOKUP(B13,'2000'!$B15:$H15,'2000'!B$1:H$1)))","v":"NA"},{"$f":"IF(ISERROR(LOOKUP(B13,'2000'!$B15:$H15,'2000'!B$2:H$2)),\"NA\",(LOOKUP(B13,'2000'!$B15:$H15,'2000'!B$2:H$2)))","v":"NA"},{"$f":"IF(ISERROR(LOOKUP(B13,'2000'!$B15:$H15,'2000'!B$3:H$3)),\"NA\",(LOOKUP(B13,'2000'!$B15:$H15,'2000'!B$3:H$3)))","v":"NA"}]
["Chrysene",{"$f":"MAX('1990'!B17:H17,'1998'!B16:F16,'1999'!B16:M16,'2000'!B16:H16,'2002'!G16:U16)","v":1.56},{"$f":"IF(ISERROR(LOOKUP(B14,'2000'!$B16:$H16,'2000'!$B$1:H$1)),\"NA\",(LOOKUP(B14,'2000'!$B16:$H16,'2000'!B$1:H$1)))","v":"NA"},{"$f":"IF(ISERROR(LOOKUP(B14,'2000'!$B16:$H16,'2000'!B$2:H$2)),\"NA\",(LOOKUP(B14,'2000'!$B16:$H16,'2000'!B$2:H$2)))","v":"NA"},{"$f":"IF(ISERROR(LOOKUP(B14,'2000'!$B16:$H16,'2000'!B$3:H$3)),\"NA\",(LOOKUP(B14,'2000'!$B16:$H16,'2000'!B$3:H$3)))","v":"NA"}]
["Dibenz(a,h)anthracene",{"$f":"MAX('1990'!B18:H18,'1998'!B17:F17,'1999'!B17:M17,'2000'!B17:H17,'2002'!G17:U17)","v":0},{"$f":"IF(ISERROR(LOOKUP(B15,'2000'!$B17:$H17,'2000'!$B$1:H$1)),\"NA\",(LOOKUP(B15,'2000'!$B17:$H17,'2000'!B$1:H$1)))","v":"NA"},{"$f":"IF(ISERROR(LOOKUP(B15,'2000'!$B17:$H17,'2000'!B$2:H$2)),\"NA\",(LOOKUP(B15,'2000'!$B17:$H17,'2000'!B$2:H$2)))","v":"NA"},{"$f":"IF(ISERROR(LOOKUP(B15,'2000'!$B17:$H17,'2000'!B$3:H$3)),\"NA\",(LOOKUP(B15,'2000'!$B17:$H17,'2000'!B$3:H$3)))","v":"NA"}]
["Indeno(1,2,3-cd)pyrene",{"$f":"MAX('1990'!B19:H19,'1998'!B18:F18,'1999'!B18:M18,'2000'!B18:H18,'2002'!G18:U18)","v":0.624},{"$f":"IF(ISERROR(LOOKUP(B16,'2000'!$B18:$H18,'2000'!$B$1:H$1)),\"NA\",(LOOKUP(B16,'2000'!$B18:$H18,'2000'!B$1:H$1)))","v":"NA"},{"$f":"IF(ISERROR(LOOKUP(B16,'2000'!$B18:$H18,'2000'!B$2:H$2)),\"NA\",(LOOKUP(B16,'2000'!$B18:$H18,'2000'!B$2:H$2)))","v":"NA"},{"$f":"IF(ISERROR(LOOKUP(B16,'2000'!$B18:$H18,'2000'!B$3:H$3)),\"NA\",(LOOKUP(B16,'2000'!$B18:$H18,'2000'!B$3:H$3)))","v":"NA"}]
["Naphthalene",{"$f":"MAX('1990'!B21:H21,'1998'!B19:F19,'1999'!B19:M19,'2000'!B19:H19,'2002'!G19:U19)","v":3},{"$f":"IF(ISERROR(LOOKUP(B17,'2000'!$B19:$H19,'2000'!$B$1:H$1)),\"NA\",(LOOKUP(B17,'2000'!$B19:$H19,'2000'!B$1:H$1)))","v":"SB-23"},{"$f":"IF(ISERROR(LOOKUP(B17,'2000'!$B19:$H19,'2000'!B$2:H$2)),\"NA\",(LOOKUP(B17,'2000'!$B19:$H19,'2000'!B$2:H$2)))","v":"(14-16)"},{"$f":"IF(ISERROR(LOOKUP(B17,'2000'!$B19:$H19,'2000'!B$3:H$3)),\"NA\",(LOOKUP(B17,'2000'!$B19:$H19,'2000'!B$3:H$3)))","v":"2000-10-04"}]
["Method 8015"]
["TPH (C6-C12)","-",{"$f":"IF(ISERROR(LOOKUP(B19,'2000'!B$6:H$6,'2000'!B$1:H$1)),\"NA\",(LOOKUP(B19,'2000'!B$6:H$6,'2000'!B$1:H$1)))","v":"NA"},{"$f":"IF(ISERROR(LOOKUP(B19,'2000'!$B21:$H21,'2000'!B$2:H$2)),\"NA\",(LOOKUP(B19,'2000'!$B21:$H21,'2000'!B$2:H$2)))","v":"NA"},{"$f":"IF(ISERROR(LOOKUP(B19,'2000'!$B21:$H21,'2000'!B$3:H$3)),\"NA\",(LOOKUP(B19,'2000'!$B21:$H21,'2000'!B$3:H$3)))","v":"NA"}]
["TPH (C10-C20)",{"$f":"MAX('1990'!B24:H24,'1998'!B23:F23,'1999'!B23:M23,'2000'!B23:H23,'2002'!G22:U22)","v":189},{"$f":"IF(ISERROR(LOOKUP(B20,'2000'!B$6:H$6,'2000'!B$1:H$1)),\"NA\",(LOOKUP(B20,'2000'!B$6:H$6,'2000'!B$1:H$1)))","v":"SB-23"},{"$f":"IF(ISERROR(LOOKUP(B20,'2000'!$B22:$H22,'2000'!B$2:H$2)),\"NA\",(LOOKUP(B20,'2000'!$B22:$H22,'2000'!B$2:H$2)))","v":"NA"},{"$f":"IF(ISERROR(LOOKUP(B20,'2000'!$B22:$H22,'2000'!B$3:H$3)),\"NA\",(LOOKUP(B20,'2000'!$B22:$H22,'2000'!B$3:H$3)))","v":"NA"}]
["TPH (C20-C34)",{"$f":"MAX('1990'!B25:H25,'1998'!B24:F24,'1999'!B24:M24,'2000'!B24:H24,'2002'!G23:U23)","v":124},{"$f":"IF(ISERROR(LOOKUP(B21,'2000'!B$6:H$6,'2000'!B$1:H$1)),\"NA\",(LOOKUP(B21,'2000'!B$6:H$6,'2000'!B$1:H$1)))","v":"SB-23"},{"$f":"IF(ISERROR(LOOKUP(B21,'2000'!$B23:$H23,'2000'!B$2:H$2)),\"NA\",(LOOKUP(B21,'2000'!$B23:$H23,'2000'!B$2:H$2)))","v":"NA"},{"$f":"IF(ISERROR(LOOKUP(B21,'2000'!$B23:$H23,'2000'!B$3:H$3)),\"NA\",(LOOKUP(B21,'2000'!$B23:$H23,'2000'!B$3:H$3)))","v":"NA"}]

{"sheet":"1990","index":1,"n_rows":23,"n_cols":8,"rows_kept":23,"cut":false,"hidden":false,"merged":[]}
["Sample","SB-1","SB-2","SB-3","SB-4","SB-5","SB-6","SB-7"]
["Depth","5 Feet","5 Feet","5 Feet","5 Feet","5 Feet","5 Feet","5 Feet"]
["DDate","1990-01-12","1990-01-12","1990-01-12","1990-01-12","1990-01-12","1990-01-12","1990-01-12"]
["Table1990"]
["Method 8020","SB-1;5 Feet;32885","SB-2;5 Feet;32885","SB-3;5 Feet;32885","SB-4;5 Feet;32885","SB-5;5 Feet;32885","SB-6;5 Feet;32885","SB-7;5 Feet;32885"]
["Benzene",1.4,0.45,"<0.003",0.13,"<0.003","<0.003",1.05]
["Toluene",1.35,4.16,0.38,10.4,0.22,"<0.003",11]
["Ethylbenzene",1.9,2.48,0.38,12.8,0.39,"<0.003",2.0299999999999998]
["Total Xylenes",9.1999999999999993,14.9,3.06,96,0.83,"<0.003",116]
["MTBE","NA","NA","NA","NA","NA","NA","NA"]
["Method 8310"]
["Benzo(a)anthracene","NA","NA","NA","NA","NA","NA","NA"]
["Benzo(a)pyrene","NA","NA","NA","NA","NA","NA","NA"]
["Benzo(b)fluoranthene","NA","NA","NA","NA","NA","NA","NA"]
["Benzo(k)fluoranthene","NA","NA","NA","NA","NA","NA","NA"]
["Chrysene","NA","NA","NA","NA","NA","NA","NA"]
["Dibenz(a,h)anthracene","NA","NA","NA","NA","NA","NA","NA"]
["Indeno(1,2,3-cd)pyrene","NA","NA","NA","NA","NA","NA","NA"]
["Naphthalene","NA","NA","NA","NA","NA","NA","NA"]
["Method 8015"]
["TPH (C6-C12)","NA","NA","NA","NA","NA","NA","NA"]
["TPH (C10-C20)","NA","NA","NA","NA","NA","NA","NA"]
["TPH (C20-C34)","NA","NA","NA","NA","NA","NA","NA"]

{"sheet":"1998","index":2,"n_rows":26,"n_cols":6,"rows_kept":26,"cut":false,"hidden":false,"merged":[]}
["Sample","SB-8","SB-9","SB-10","SB-11","SB-12"]
["Depth","(14-16)","(12-14)","(14-16)","14'","1'"]
["DDate","1998-03-05","1998-03-05","1998-03-05","1998-04-17","1998-04-17"]
["Table1998"]
["Method 8020","SB-8;(14-16);35859","SB-9;(12-14);35859","SB-10;(14-16);35859","SB-11;14';35902","SB-12;1';35902"]
["Benzene",3.1E-2,2.7,5.0999999999999997E-2,"<0.005","<0.005"]
["Toluene",9.1999999999999998E-2,3.8,8.7999999999999995E-2,"<0.005","<0.005"]
["Ethylbenzene",0.12,1.1000000000000001,3.2000000000000001E-2,"<0.005","<0.005"]
["Total Xylenes",0.23,4.4000000000000004,0.1,"<0.005","<0.005"]
["MTBE","NA","NA","NA","NA","NA"]
["Method 8310"]
["Benzo(a)anthracene","<0.330","<0.330","<0.330","<0.50","<0.50"]
["Benzo(a)pyrene","<0.330","<0.330","<0.330","<0.50","<0.50"]
["Benzo(b)fluoranthene","<0.330","<0.330","<0.330","<0.50","<0.50"]
["Benzo(k)fluoranthene","<0.330","<0.330","<0.330","<0.50","<0.50"]
["Chrysene","<0.330","<0.330","<0.330","<0.50","<0.50"]
["Dibenz(a,h)anthracene","<0.330","<0.330","<0.330","<0.50","<0.50"]
["Indeno(1,2,3-cd)pyrene","<0.330","<0.330","<0.330","<0.50","<0.50"]
["Naphthalene","<0.330","<0.330","<0.330","<0.50","<0.50"]
["Method 8015"]
["TPH (C6-C12)","NA","NA","NA","NA","NA"]
["TPH (C10-C20)","NA","NA","NA","NA","NA"]
["TPH (C20-C34)","NA","NA","NA","NA","NA"]
[]
[]
["*Stockpile returned to excavation"]

{"sheet":"1999","index":3,"n_rows":23,"n_cols":13,"rows_kept":23,"cut":false,"hidden":false,"merged":[]}
["Sample","SB-13","SB-13","SB-14","SB-14","SB-15","SB-15","SB-16","SB-17","SB-17","SB-18","SB-19","SB-19"]
["Depth","(2-4)","(14-16)","(12-14)","(18-20)","(16-18)","(18-20)","(2-4)","(12-14)","(18-20)","(12-14)","(14-16)","(18-20)"]
["DDate","1999-11-14","1999-11-14","1999-11-14","1999-11-14","1999-11-14","1999-11-14","1999-11-14","1999-11-14","1999-11-14","1999-11-14","1999-11-14","1999-11-14"]
["Table1999"]
["Method 8021","SB-13;(2-4);36478","SB-13;(14-16);36478","SB-14;(12-14);36478","SB-14;(18-20);36478","SB-15;(16-18);36478","SB-15;(18-20);36478","SB-16;(2-4);36478","SB-17;(12-14);36478","SB-17;(18-20);36478","SB-18;(12-14);36478","SB-19;(14-16);36478","SB-19;(18-20);36478"]
["Benzene",0.03,2.57,4.8000000000000001E-2,1.58,1.74,0.67100000000000004,1.4E-2,3.4000000000000002E-2,3.7999999999999999E-2,"<0.005",0.11,0.377]
["Toluene",8.1000000000000003E-2,4.13,0.20200000000000001,2.11,1.1000000000000001,0.65500000000000003,1.4E-2,2.5999999999999999E-2,2.8000000000000001E-2,6.0000000000000001E-3,0.11799999999999999,0.104]
["Ethylbenzene",8.0000000000000002E-3,3.41,0.40500000000000003,3.73,3.03,0.10100000000000001,1.2E-2,0.124,6.6000000000000003E-2,0.01,0.45500000000000002,0.377]
["Total Xylenes",1.5740000000000001,9.25,1.573,11.76,7.08,0.36,5.8000000000000003E-2,0.23400000000000001,0.17699999999999999,6.0999999999999999E-2,1.0369999999999999,0.57699999999999996]
["MTBE","NA","NA","NA","NA","NA","NA","NA","NA","NA","NA","NA","NA"]
["Method 8310"]
["Benzo(a)anthracene","<0.0026","<0.0026","<0.0026","<0.0026","<0.0026","<0.0026","<0.0026","<0.0026","<0.0026","<0.0026","<0.0026","<0.0026"]
["Benzo(a)pyrene","<0.004","<0.004","<0.004","<0.004","<0.004","<0.004","<0.004","<0.004","<0.004","<0.004","<0.004","<0.004"]
["Benzo(b)fluoranthene","<0.0036","<0.0036","<0.0036","<0.0036","<0.0036","<0.0036","<0.0036","<0.0036","<0.0036","<0.0036","<0.0036","<0.0036"]
["Benzo(k)fluoranthene","<0.0034","<0.0034","<0.0034","<0.0034","<0.0034","<0.0034","<0.0034","<0.0034","<0.0034","<0.0034","<0.0034","<0.0034"]
["Chrysene","<0.003","<0.003","<0.003","<0.003","<0.003","<0.003","<0.003","<0.003","<0.003","<0.003","<0.003","<0.003"]
["Dibenz(a,h)anthracene","<0.006","<0.006","<0.006","<0.006","<0.006","<0.006","<0.006","<0.006","<0.006","<0.006","<0.006","<0.006"]
["Indeno(1,2,3-cd)pyrene","<0.0086","<0.0086","<0.0086","<0.0086","<0.0086","<0.0086","<0.0086","<0.0086","<0.0086","<0.0086","<0.0086","<0.0086"]
["Naphthalene",0.44500000000000001,"<0.025","<0.025","<0.025","<0.025","<0.025","<0.025","<0.025","<0.025","<0.025","<0.025","<0.025"]
["Method 8015"]
["TPH (C6-C12)","NA","NA","NA","NA","NA","NA","NA","NA","NA","NA","NA","NA"]
["TPH (C10-C20)","NA","NA","NA","NA","NA","NA","NA","NA","NA","NA","NA","NA"]
["TPH (C20-C34)","NA","NA","NA","NA","NA","NA","NA","NA","NA","NA","NA","NA"]

{"sheet":"2000","index":4,"n_rows":23,"n_cols":8,"rows_kept":23,"cut":false,"hidden":false,"merged":[]}
["Sample","SB-20","SB-20","SB-20","SB-21","SB-21","SB-23","SB-23"]
["Depth","(12-14)","(14-16)","(16-18)","(12-14)","(20-22)","(10-12)","(14-16)"]
["DDate","2000-10-03","2000-10-03","2000-10-03","2000-10-03","2000-10-04","2000-10-04","2000-10-04"]
["Table2000"]
["Method 8021","SB-20;(12-14);36802","SB-20;(14-16);36802","SB-20;(16-18);36802","SB-21;(12-14);36802","SB-21;(20-22);36803","SB-23;(10-12);36803","SB-23;(14-16);36803"]
["Benzene","<0.320","<0.340",4.4000000000000004,"<0.001","<0.001",5.2,7]
["Toluene","<0.320","<0.340",1.1000000000000001,"<0.001","<0.001",16,9.6]
["Ethylbenzene",3.7,2.8,8.9,"<0.001","<0.001",8.8000000000000007,8.9]
["Total Xylenes",2.9,2.7,6.5,1.2999999999999999E-3,"<0.001",55,34]
["MTBE","<0.320","<0.340",0.32,"<0.001","<0.001",0.46,0.5]
["Method 8310"]
["Benzo(a)anthracene","<0.064","<0.067","<0.031","<0.062","<0.032","<0.064","<0.030"]
["Benzo(a)pyrene","<0.064","<0.067","<0.031","<0.062","<0.032","<0.064","<0.030"]
["Benzo(b)fluoranthene","<0.064","<0.067","<0.031","<0.062","<0.032","<0.064","<0.030"]
["Benzo(k)fluoranthene","<0.064","<0.067","<0.031","<0.062","<0.032","<0.064","<0.030"]
["Chrysene","<0.064","<0.067","<0.031","<0.062","<0.032","<0.064","<0.030"]
["Dibenz(a,h)anthracene","<0.064","<0.067","<0.031","<0.062","<0.032","<0.064","<0.030"]
["Indeno(1,2,3-cd)pyrene","<0.064","<0.067","<0.031","<0.062","<0.032","<0.064","<0.030"]
["Naphthalene",1.1000000000000001,0.83,0.59,"<0.120","<0.630",1.8,3]
["Method 8015"]
["TPH (C6-C12)","NA","NA","NA","NA","NA","NA","NA"]
["TPH (C10-C20)","NA","NA","NA","NA","NA","NA","NA"]
["TPH (C20-C34)","NA","NA","NA","NA","NA","NA","NA"]

{"sheet":"2002","index":5,"n_rows":23,"n_cols":21,"rows_kept":23,"cut":false,"hidden":false,"merged":[]}
["Sample","AB-1","AB-1","AB-2","AB-2","AB-3","AB-3","AB-4","AB-4","SB-24","SB-24","SB-26","SB-26","SB-27","SB-27","SB-28","SB-28","SB-29","SB-29","SB-30","SB-30"]
["Depth","(10-12)","(14-16)","(0-2)","(12-14)","(0-2)","(14-16)","(2-4)","(12-14)","(0-2)","(10-12)","(0-2)","(8-10)","(4-6)","(6-8)","(6-8)","(10-12)","(4-6)","(12-14)","(6-8)","(16-17.5)"]
["DDate","2002-04-02","2002-04-02","2002-04-02","2002-04-02","2002-04-02","2002-04-02","2002-04-03","2002-04-03","2002-12-10","2002-12-10","2002-12-10","2002-12-10","2002-12-14","2002-12-14","2002-12-14","2002-12-14","2002-12-14","2002-12-14","2002-12-14","2002-12-14"]
["Table2002"]
["Method 8260","AB-1;(10-12);37348","AB-1;(14-16);37348","AB-2;(0-2);37348","AB-2;(12-14);37348","AB-3;(0-2);37348","AB-3;(14-16);37348","AB-4;(2-4);37349","AB-4;(12-14);37349","SB-24;(0-2);37600","SB-24;(10-12);37600","SB-26;(0-2);37600","SB-26;(8-10);37600","SB-27;(4-6);37604","SB-27;(6-8);37604","SB-28;(6-8);37604","SB-28;(10-12);37604","SB-29;(4-6);37604","SB-29;(12-14);37604","SB-30;(6-8);37604","SB-30;(16-17.5);37604"]
["Benzene","<0.012","<0.013","<0.011","<0.012",2.3E-2,3.98,"<0.013","<0.013","<0.011","<0.012","<0.012",1.4E-2,"<0.006","<0.006","<0.006","<0.006","<0.006","<0.006","<0.006","<0.007"]
["Toluene","<0.012","<0.013","<0.011","<0.012",3.4000000000000002E-2,14.9,"<0.013","<0.013","<0.011","<0.012","<0.012","<0.012","<0.006","<0.006","<0.006","<0.006","<0.006","<0.006","<0.006","<0.007"]
["Ethylbenzene","<0.012","<0.013","<0.011","<0.012",2.2799999999999998,6.31,"<0.013","<0.013","<0.011","<0.012","<0.012",1.95E-2,"<0.006","<0.006","<0.006","<0.006","<0.006","<0.006","<0.006","<0.007"]
["Total Xylenes","<0.012","<0.013","<0.011","<0.012",3.54,24.7,"<0.013","<0.013","<0.011","<0.012","<0.012","<0.012","<0.006","<0.006","<0.006","<0.006","<0.006","<0.006","<0.006","<0.007"]
["MTBE","<0.049","<0.050","<0.045","<0.050","<0.051","<0.05","<0.051","<0.051","<0.046","<0.048","<0.049","<0.049","<0.006","<0.006","<0.006","<0.006","<0.006","<0.006","<0.006","<0.007"]
["Method 8270"]
["Benzo(a)anthracene","<0.182","<0.188","<0.169","<0.186","<0.190","<0.185","<0.191","<0.191",1.23,"<0.182","<0.185","<0.183","<0.174","<0.182","<0.182","<0.185","<0.189","<0.186","<0.188","<0.194"]
["Benzo(a)pyrene","<0.182","<0.188","<0.169","<0.186","<0.190","<0.185","<0.191","<0.191",1.56,"<0.182","<0.185","<0.183","<0.174","<0.182","<0.182","<0.185","<0.189","<0.186","<0.188","<0.194"]
["Benzo(b)fluoranthene","<0.182","<0.188","<0.169","<0.186","<0.190","<0.185","<0.191","<0.191",2.27,"<0.182","<0.185","<0.183","<0.174","<0.182","<0.182","<0.185","<0.189","<0.186","<0.188","<0.194"]
["Benzo(k)fluoranthene","<0.182","<0.188","<0.169","<0.186","<0.190","<0.185","<0.191","<0.191",1.31,"<0.182","<0.185","<0.183","<0.174","<0.182","<0.182","<0.185","<0.189","<0.186","<0.188","<0.194"]
["Chrysene","<0.182","<0.188","<0.169","<0.186","<0.190","<0.185","<0.191","<0.191",1.56,"<0.182","<0.185","<0.183","<0.174","<0.182","<0.182","<0.185","<0.189","<0.186","<0.188","<0.194"]
["Dibenz(a,h)anthracene","<0.182","<0.188","<0.169","<0.186","<0.190","<0.185","<0.191","<0.191","<0.171","<0.182","<0.185","<0.183","<0.174","<0.182","<0.182","<0.185","<0.189","<0.186","<0.188","<0.194"]
["Indeno(1,2,3-cd)pyrene","<0.182","<0.188","<0.169","<0.186","<0.190","<0.185","<0.191","<0.191",0.624,"<0.182","<0.185","<0.183","<0.174","<0.182","<0.182","<0.185","<0.189","<0.186","<0.188","<0.194"]
["Naphthalene","<0.182","<0.188","<0.169","<0.186",0.54200000000000004,1.52,"<0.191","<0.191","<0.171","<0.182","<0.185","<0.183","<0.174","<0.182","<0.182","<0.185","<0.189","<0.186","<0.188","<0.194"]
["Method 8015"]
["TPH (C6-C12)","NA","NA","NA","NA","NA","NA","NA","NA","NA","NA","NA","NA","NA","NA","NA","NA","NA","NA","NA","NA"]
["TPH (C10-C20)","<12.0",13.5,"<11.0","<12.0",88.1,56.3,13.2,"<13.0",189,"<12.0","<12.0","<12.0","<12.0","<12.0","<12.0","<12.0","<13.0","<13.0","<13.0","<13.0"]
["TPH (C20-C34)","<12.0",28.6,72.599999999999994,17.399999999999999,"<13.0",19.7,23.2,"<13.0",124,13.3,"<12.0","<12.0","<23.0","<24.0","<24.0","<25.0","<25.0","<25.0","<25.0","<26.0"]

{"sheet":"M8260","index":6,"n_rows":256,"n_cols":6,"rows_kept":256,"cut":false,"hidden":false,"merged":[]}
["Row","Sample","Depth","DDate","Value","Page1"]
["Benzene","SB-1","5 Feet","1990-01-12",1.4,"1990"]
["Benzene","SB-2","5 Feet","1990-01-12",0.45,"1990"]
["Benzene","SB-3","5 Feet","1990-01-12","<0.003","1990"]
["Benzene","SB-4","5 Feet","1990-01-12",0.13,"1990"]
["Benzene","SB-5","5 Feet","1990-01-12","<0.003","1990"]
["Benzene","SB-6","5 Feet","1990-01-12","<0.003","1990"]
["Benzene","SB-7","5 Feet","1990-01-12",1.05,"1990"]
["Toluene","SB-1","5 Feet","1990-01-12",1.35,"1990"]
["Toluene","SB-2","5 Feet","1990-01-12",4.16,"1990"]
["Toluene","SB-3","5 Feet","1990-01-12",0.38,"1990"]
["Toluene","SB-4","5 Feet","1990-01-12",10.4,"1990"]
["Toluene","SB-5","5 Feet","1990-01-12",0.22,"1990"]
["Toluene","SB-6","5 Feet","1990-01-12","<0.003","1990"]
["Toluene","SB-7","5 Feet","1990-01-12",11,"1990"]
["Ethylbenzene","SB-1","5 Feet","1990-01-12",1.9,"1990"]
["Ethylbenzene","SB-2","5 Feet","1990-01-12",2.48,"1990"]
["Ethylbenzene","SB-3","5 Feet","1990-01-12",0.38,"1990"]
["Ethylbenzene","SB-4","5 Feet","1990-01-12",12.8,"1990"]
["Ethylbenzene","SB-5","5 Feet","1990-01-12",0.39,"1990"]
["Ethylbenzene","SB-6","5 Feet","1990-01-12","<0.003","1990"]
["Ethylbenzene","SB-7","5 Feet","1990-01-12",2.0299999999999998,"1990"]
["Total Xylenes","SB-1","5 Feet","1990-01-12",9.1999999999999993,"1990"]
["Total Xylenes","SB-2","5 Feet","1990-01-12",14.9,"1990"]
["Total Xylenes","SB-3","5 Feet","1990-01-12",3.06,"1990"]
["Total Xylenes","SB-4","5 Feet","1990-01-12",96,"1990"]
["Total Xylenes","SB-5","5 Feet","1990-01-12",0.83,"1990"]
["Total Xylenes","SB-6","5 Feet","1990-01-12","<0.003","1990"]
["Total Xylenes","SB-7","5 Feet","1990-01-12",116,"1990"]
["MTBE","SB-1","5 Feet","1990-01-12","NA","1990"]
["MTBE","SB-2","5 Feet","1990-01-12","NA","1990"]
["MTBE","SB-3","5 Feet","1990-01-12","NA","1990"]
["MTBE","SB-4","5 Feet","1990-01-12","NA","1990"]
["MTBE","SB-5","5 Feet","1990-01-12","NA","1990"]
["MTBE","SB-6","5 Feet","1990-01-12","NA","1990"]
["MTBE","SB-7","5 Feet","1990-01-12","NA","1990"]
["Benzene","SB-8","(14-16)","1998-03-05",3.1E-2,"1998"]
["Benzene","SB-9","(12-14)","1998-03-05",2.7,"1998"]
["Benzene","SB-10","(14-16)","1998-03-05",5.0999999999999997E-2,"1998"]
["Benzene","SB-11","14'","1998-04-17","<0.005","1998"]
["Benzene","SB-12","1'","1998-04-17","<0.005","1998"]
["Toluene","SB-8","(14-16)","1998-03-05",9.1999999999999998E-2,"1998"]
["Toluene","SB-9","(12-14)","1998-03-05",3.8,"1998"]
["Toluene","SB-10","(14-16)","1998-03-05",8.7999999999999995E-2,"1998"]
["Toluene","SB-11","14'","1998-04-17","<0.005","1998"]
["Toluene","SB-12","1'","1998-04-17","<0.005","1998"]
["Ethylbenzene","SB-8","(14-16)","1998-03-05",0.12,"1998"]
["Ethylbenzene","SB-9","(12-14)","1998-03-05",1.1000000000000001,"1998"]
["Ethylbenzene","SB-10","(14-16)","1998-03-05",3.2000000000000001E-2,"1998"]
["Ethylbenzene","SB-11","14'","1998-04-17","<0.005","1998"]
["Ethylbenzene","SB-12","1'","1998-04-17","<0.005","1998"]
["Total Xylenes","SB-8","(14-16)","1998-03-05",0.23,"1998"]
["Total Xylenes","SB-9","(12-14)","1998-03-05",4.4000000000000004,"1998"]
["Total Xylenes","SB-10","(14-16)","1998-03-05",0.1,"1998"]
["Total Xylenes","SB-11","14'","1998-04-17","<0.005","1998"]
["Total Xylenes","SB-12","1'","1998-04-17","<0.005","1998"]
["MTBE","SB-8","(14-16)","1998-03-05","NA","1998"]
["MTBE","SB-9","(12-14)","1998-03-05","NA","1998"]
["MTBE","SB-10","(14-16)","1998-03-05","NA","1998"]
["MTBE","SB-11","14'","1998-04-17","NA","1998"]
["MTBE","SB-12","1'","1998-04-17","NA","1998"]
["Benzene","SB-13","(2-4)","1999-11-14",0.03,"1999"]
["Benzene","SB-13","(14-16)","1999-11-14",2.57,"1999"]
["Benzene","SB-14","(12-14)","1999-11-14",4.8000000000000001E-2,"1999"]
["Benzene","SB-14","(18-20)","1999-11-14",1.58,"1999"]
["Benzene","SB-15","(16-18)","1999-11-14",1.74,"1999"]
["Benzene","SB-15","(18-20)","1999-11-14",0.67100000000000004,"1999"]
["Benzene","SB-16","(2-4)","1999-11-14",1.4E-2,"1999"]
["Benzene","SB-17","(12-14)","1999-11-14",3.4000000000000002E-2,"1999"]
["Benzene","SB-17","(18-20)","1999-11-14",3.7999999999999999E-2,"1999"]
["Benzene","SB-18","(12-14)","1999-11-14","<0.005","1999"]
["Benzene","SB-19","(14-16)","1999-11-14",0.11,"1999"]
["Benzene","SB-19","(18-20)","1999-11-14",0.377,"1999"]
["Toluene","SB-13","(2-4)","1999-11-14",8.1000000000000003E-2,"1999"]
["Toluene","SB-13","(14-16)","1999-11-14",4.13,"1999"]
["Toluene","SB-14","(12-14)","1999-11-14",0.20200000000000001,"1999"]
["Toluene","SB-14","(18-20)","1999-11-14",2.11,"1999"]
["Toluene","SB-15","(16-18)","1999-11-14",1.1000000000000001,"1999"]
["Toluene","SB-15","(18-20)","1999-11-14",0.65500000000000003,"1999"]
["Toluene","SB-16","(2-4)","1999-11-14",1.4E-2,"1999"]
{"$rows_left_out":176}